{"text_format":"1","workbook":"xlsx","n_sheets":3,"sheets":["Notes Balance","Cumulative Defaults","Collateral Tables"],"not_rendered":{"charts":1,"images":0,"macros":1,"external_links":8,"defined_names":24,"comments":1,"pivot_tables":0},"unopened":[],"bounds":{"document_bytes":16777216,"sheet_cells":100000,"rows_first":2000,"rows_last":500,"rows_between":2000,"halvings":0,"cell_chars":16384,"cell_head_chars":4096},"cells_cut":0,"cells_raw":0,"read":"whole","date_system":"1900"}

{"sheet":"Notes Balance","index":0,"n_rows":42,"n_cols":6,"rows_kept":42,"cut":false,"hidden":false,"merged":[]}
["TOTAL NOTE BALANCES"]
[null,"Total Notes","Class A1 Notes","Class A2 Notes","Class B Notes","Class C Notes"]
["Initial Invested Amount",{"$f":"SUM(C3:F3)","v":423450000},115000000,286850000,11250000,10350000]
["Invested Amount as at Previous Payment Date:  16 August 2018",{"$f":"SUM(C4:F4)","v":423450000},115000000,286850000,11250000,10350000]
["Stated Amount as at Previous Payment Date:  16 August 2018",423450000,115000000,286850000,11250000,10350000]
["Principal Payments to Noteholders on Payment Date",39614786.810000002,39614786.810000002,0,0,0]
["Gross Aggregate Charge-Offs",0,0,0,0,0]
["Gross Aggregate Reinstatements of charge-offs",0,0,0,0,0]
["Aggregate Charge-Offs for this Collection Period",0,0,0,0,0]
["Reinstatements relating to Charge-offs that have occurred this Collection Period",0,0,0,0,0]
["Aggregate Carry Over Charge-offs not previously reinstated",0,0,0,0,0]
["Reinstatements of Carry Over Charge-offs not previously reinstated",0,0,0,0,0]
["Aggregate Charge-Offs not reinstated and to be carried over to next period",0,0,0,0,0]
["Invested Amount as at Payment Date:  16 November 2018",383835213.19,75385213.189999998,286850000,11250000,10350000]
["Stated Amount as at Payment Date:  16 November 2018",383835213.19,75385213.189999998,286850000,11250000,10350000]
["Bond Factor at Payment Date:  16 November 2018",null,0.65552359295652174,1,1,1]
["Coupon Margin",null,7.3000000000000001E-3,1.0800000000000001E-2,1.7000000000000001E-2,2.2499999999999999E-2]
["Coupon Rate (3 month BBSW + margin)",null,2.6850000000000002E-2,3.0350000000000002E-2,3.6549999999999999E-2,4.2050000000000004E-2]
["Days in Coupon Period",null,92,92,92,92]
["Coupon Entitlement to be paid out on the current Payment Date: 16 November 2018",null,778282.19,2194363.21,103641.78,109698.66]
[]
[]
["TOTAL NOTE BALANCES"]
[null,"Total Notes","Class A1 Notes","Class A2 Notes","Class B Notes","Class C Notes"]
["Initial Invested Amount",{"$f":"SUM(C25:F25)","v":423450000},115000000,286850000,11250000,10350000]
["Invested Amount as at Previous Payment Date:  16 November 2018",{"$f":"SUM(C26:F26)","v":383835213.19},75385213.189999998,286850000,11250000,10350000]
["Stated Amount as at Previous Payment Date:  16 November 2018",383835213.19,75385213.189999998,286850000,11250000,10350000]
["Principal Payments to Noteholders on Payment Date",27133674.77,27133674.77,0,0,0]
["Gross Aggregate Charge-Offs",0,0,0,0,0]
["Gross Aggregate Reinstatements of charge-offs",0,0,0,0,0]
["Aggregate Charge-Offs for this Collection Period",0,0,0,0,0]
["Reinstatements relating to Charge-offs that have occurred this Collection Period",0,0,0,0,0]
["Aggregate Carry Over Charge-offs not previously reinstated",0,0,0,0,0]
["Reinstatements of Carry Over Charge-offs not previously reinstated",0,0,0,0,0]
["Aggregate Charge-Offs not reinstated and to be carried over to next period",0,0,0,0,0]
["Invested Amount as at Payment Date:  18 February 2019",356701538.42000002,48251538.420000002,286850000,11250000,10350000]
["Stated Amount as at Payment Date:  18 February 2019",356701538.42000002,48251538.420000002,286850000,11250000,10350000]
["Bond Factor at Payment Date:  18 February 2019",null,0.41957859495652178,1,1,1]
["Coupon Margin",null,7.3000000000000001E-3,1.0800000000000001E-2,1.7000000000000001E-2,2.2499999999999999E-2]
["Coupon Rate (3 month BBSW + margin)",null,2.6710000000000001E-2,3.0210000000000001E-2,3.6409999999999998E-2,4.1910000000000003E-2]
["Days in Coupon Period",null,94,94,94,94]
["Coupon Entitlement to be paid out on the current Payment Date: 18 February 2019",null,518555.26,2231724.44,105489.25,111710.24]

{"sheet":"Cumulative Defaults","index":1,"n_rows":8,"n_cols":4,"rows_kept":8,"cut":false,"hidden":false,"merged":[]}
["Cumulative Defaults & Losses"]
[]
["Month","Gross Losses","Recoveries","Net Losses"]
["2018-10-01",0,0,0]
["2019-01-01",{"$f":"B4+'Collateral Tables'!E9/450000000","v":0},{"$f":"+C4+'Collateral Tables'!E23/450000000","v":0},{"$f":"B5-C5","v":0}]
["2019-04-01"]
["2019-07-01"]
["2019-10-01"]

{"sheet":"Collateral Tables","index":2,"n_rows":238,"n_cols":11,"rows_kept":238,"cut":false,"hidden":false,"merged":[]}
[null,"CNHI CAPITAL AUSTRALIA RECEIVABLES TRUST SERIES 2018-1 (TERM DEAL)"]
[null,"COLLATERAL DATA TABLES"]
[]
[null,"OUTSTANDING RECEIVABLES",null,null,"2018-01-31",null,null,null,"2018-10-31"]
[]
[null,"Opening Balance",null,null,{"$f":"'[2]18 Feb 19'!M163","v":410385213.19},null,null,null,449999896.88999999]
[null,"Principal Repayments - Scheduled",null,null,{"$f":"MIN(([3]Sheet1!$B$3+[4]Sheet1!$B$3+[5]Sheet1!$B$3),'[2]18 Feb 19'!H23)","v":25925049.640000001},null,null,null,32152734.129999999]
[null,"Principal Repayments - Unscheduled",null,null,{"$f":"'[2]18 Feb 19'!H23-'Collateral Tables'!E7","v":1208625.1300000101},null,null,null,7461949.5699999668]
[{"$f":"SUM(I9)","v":0},"Charge-Offs",null,null,{"$f":"'[2]18 Feb 19'!$H37","v":0},null,null,null,0]
[null,"Reinstatements"]
[null,"New Receivables Purchased"]
[null,"Non Cash Change in Receivables"]
[null,"Closing Balance",null,null,{"$f":"E6-E7-E8-E9+E10+E11-E12","v":383251538.42000002},null,null,null,410385213.19]
[]
[null,"PORTFOLIO STATISTICS"]
[]
[null,"Summary"]
[null,"Number of contracts",null,null,{"$f":"[6]Summary!$D$4","v":3359},null,null,null,3402]
[null,"Dollar value of contracts",null,null,{"$f":"[6]Summary!$G$5","v":383251538.41999996},null,null,null,410385213.18999952]
[null,"Number of contracts closed during the Quarter",null,null,{"$f":"[6]Summary!$B$19","v":43},null,null,null,64]
[null,"Dollar value of contracts closed during the Quarter",null,null,{"$f":"[6]Summary!$B$20","v":6683029.9000000004},null,null,null,8769089.4699999988]
[]
[{"$f":"SUM(I23)","v":0},"Dollar Value of Recoveries from Collateral",null,null,{"$f":"[6]Summary!$C$16","v":0},null,null,null,0]
[null,"Dollar Value of Recoveries from Other Sources",null,null,0,null,null,null,0]
[]
[null,"Average Term of Contracts (Months)",null,null,{"$f":"[7]Sheet1!$W$3361","v":54.130152888845871},null,null,null,53.786897918104366]
[null,"Average Term to Maturity (Months)",null,null,{"$f":"[7]Sheet1!$X$3361","v":39.110875570193862},null,null,null,41.776292365564615]
[null,"Average Residual / Balloon Payment *",null,null,{"$f":"[7]Sheet1!$AI$3361","v":3.9775154630899499E-2},null,null,null,3.9736399863039409E-2]
[null,"Average Seasoning (Months)",null,null,{"$f":"E26-E27","v":15.019277318652009},null,null,null,12.010605552539751]
[null,"Average Dollar Value of Individual Assets",null,null,{"$f":"E19/E18","v":114096.91527835664},null,null,null,120630.57412992344]
[null,"Weighted Average Interest Rate",null,null,{"$f":"[7]Sheet1!$AA$3361/100","v":2.5471722602341703E-2},null,null,null,2.550199740116188E-2]
[]
[null,"Payment in Arrears"]
["1. 0 - 30 Days","0 - 30 Days",null,null,{"$f":"IFERROR(VLOOKUP(A34,'[8]Arrears Reporting'!$A$1:$D$5,3,FALSE),0)","v":3354},{"$f":"IFERROR(VLOOKUP(A34,'[8]Arrears Reporting'!$A$1:$D$5,2,FALSE),0)","v":193610.88999999998},{"$f":"F34/F$50","v":5.051796812041092E-4},null,3400,279239.7,6.8043314189957925E-4]
["2. 31 - 60 Days","31 - 60 Days",null,null,{"$f":"IFERROR(VLOOKUP(A35,'[8]Arrears Reporting'!$A$1:$D$5,3,FALSE),0)","v":3},{"$f":"IFERROR(VLOOKUP(A35,'[8]Arrears Reporting'!$A$1:$D$5,2,FALSE),0)","v":8888.9800000000032},{"$f":"F35/F$50","v":2.3193592481444121E-5},null,1,45938.869999999995,1.1194085099438339E-4]
["3. 61 - 90 Days","61 - 90 Days",null,null,{"$f":"IFERROR(VLOOKUP(A36,'[8]Arrears Reporting'!$A$1:$D$5,3,FALSE),0)","v":2},{"$f":"IFERROR(VLOOKUP(A36,'[8]Arrears Reporting'!$A$1:$D$5,2,FALSE),0)","v":16836.879999999994},4.3931669705520386E-5,null,1,2144.1999999999953,5.2248471218851559E-6]
["4. 91 - 120 Days","91 - 120 Days",null,null,{"$f":"IFERROR(VLOOKUP(A37,'[8]Arrears Reporting'!$A$1:$D$5,3,FALSE),0)","v":0},{"$f":"IFERROR(VLOOKUP(A37,'[8]Arrears Reporting'!$A$1:$D$5,2,FALSE),0)","v":0},0,null,0,0,0]
["5. 121 - 150 Days","121 - 150 Days",null,null,{"$f":"IFERROR(VLOOKUP(A38,'[8]Arrears Reporting'!$A$1:$D$5,3,FALSE),0)","v":0},{"$f":"IFERROR(VLOOKUP(A38,'[8]Arrears Reporting'!$A$1:$D$5,2,FALSE),0)","v":0},0,null,0,0,0]
["6. 151 - 180 Days","151 - 180 Days",null,null,{"$f":"IFERROR(VLOOKUP(A39,'[8]Arrears Reporting'!$A$1:$D$5,3,FALSE),0)","v":0},{"$f":"IFERROR(VLOOKUP(A39,'[8]Arrears Reporting'!$A$1:$D$5,2,FALSE),0)","v":0},0,null,0,0,0]
[null,"Total",null,null,{"$f":"SUM(E34:E39)","v":3359},{"$f":"SUM(F34:F39)","v":219336.75},{"$f":"SUM(G34:G39)","v":5.7230494339107374E-4},null,3402,327322.77,7.9759884001584784E-4]
[null,"* Expressed as a % of Aggreg. Rec. closing bal.",null,null,null,"> 30 days",{"$f":"SUM(G35:G39)","v":6.7125262186964514E-5},null,null,"> 30 days",1.1716569811626855E-4]
[]
[" 0 - 30 Days","Account Balances in Arrears"]
["1. 0 - 30 Days","0 - 30 Days",null,null,{"$f":"IFERROR(VLOOKUP(A44,'[8]Arrears Reporting'!$A$1:$D$5,3,FALSE),0)","v":3354},{"$f":"IFERROR(VLOOKUP(A44,'[8]Arrears Reporting'!$A$1:$D$5,4,FALSE),0)","v":382732142.23999995},{"$f":"F44/F$50","v":0.99864476426594062},null,3400,410108423.92999953,0.99932553793093948]
["2. 31 - 60 Days","31 - 60 Days",null,null,{"$f":"IFERROR(VLOOKUP(A45,'[8]Arrears Reporting'!$A$1:$D$5,3,FALSE),0)","v":3},{"$f":"IFERROR(VLOOKUP(A45,'[8]Arrears Reporting'!$A$1:$D$5,4,FALSE),0)","v":196286.38},{"$f":"F45/F$50","v":5.1216070993273489E-4},null,1,205758.3,5.0137844490205435E-4]
["3. 61 - 90 Days","61 - 90 Days",null,null,{"$f":"IFERROR(VLOOKUP(A46,'[8]Arrears Reporting'!$A$1:$D$5,3,FALSE),0)","v":2},{"$f":"IFERROR(VLOOKUP(A46,'[8]Arrears Reporting'!$A$1:$D$5,4,FALSE),0)","v":323109.8},8.4307502412660511E-4,null,1,71030.959999999992,1.7308362415853951E-4]
["4. 91 - 120 Days","91 - 120 Days",null,null,{"$f":"IFERROR(VLOOKUP(A47,'[8]Arrears Reporting'!$A$1:$D$5,3,FALSE),0)","v":0},{"$f":"IFERROR(VLOOKUP(A47,'[8]Arrears Reporting'!$A$1:$D$5,4,FALSE),0)","v":0},{"$f":"F47/F$50","v":0},null,0,0,0]
["5. 121 - 150 Days","121 - 150 Days",null,null,{"$f":"IFERROR(VLOOKUP(A48,'[8]Arrears Reporting'!$A$1:$D$5,3,FALSE),0)","v":0},{"$f":"IFERROR(VLOOKUP(A48,'[8]Arrears Reporting'!$A$1:$D$5,4,FALSE),0)","v":0},{"$f":"F48/F$50","v":0},null,0,0,0]
["6. 151 - 180 Days","151 - 180 Days",null,null,{"$f":"IFERROR(VLOOKUP(A49,'[8]Arrears Reporting'!$A$1:$D$5,3,FALSE),0)","v":0},{"$f":"IFERROR(VLOOKUP(A49,'[8]Arrears Reporting'!$A$1:$D$5,4,FALSE),0)","v":0},{"$f":"F49/F$50","v":0},null,0,0,0]
[null,"Total",null,null,{"$f":"SUM(E44:E49)","v":3359},{"$f":"SUM(F44:F49)","v":383251538.41999996},{"$f":"SUM(G44:G49)","v":1},null,3402,410385213.18999952,1]
["NSW",null,null,null,null,"> 30 days",{"$f":"SUM(G45:G49)","v":1.35523573405934E-3},null,null,"> 30 days",6.7446206906059385E-4]
[null,null,null,null,null,">90 days",{"$f":"SUM(G47:G49)","v":0},null,null,">90 days",0]
[]
["VIC","Geographic Distribution"]
["NSW","New South Wales",null,null,{"$f":"F55/F$63","v":0.28738603144052582},{"$f":"IFERROR(VLOOKUP(A55,'[8]Geographic '!$A$1:$C$9,3,FALSE),0)","v":110141138.66999999},null,null,0.28736145911134803,117928893.66000003]
["VIC","Victoria",null,null,{"$f":"F56/F$63","v":0.20800308285426566},{"$f":"IFERROR(VLOOKUP(A56,'[8]Geographic '!$A$1:$C$9,3,FALSE),0)","v":79717501.500000015},null,null,0.2030790640631952,83340645.00000003]
["QLD","Queensland",null,null,0.12170686868550314,{"$f":"IFERROR(VLOOKUP(A57,'[8]Geographic '!$A$1:$C$9,3,FALSE),0)","v":46644344.659999989},null,null,0.12788745367319404,52483119.93999999]
["SA","South Australia",null,null,0.18110694805335675,{"$f":"IFERROR(VLOOKUP(A58,'[8]Geographic '!$A$1:$C$9,3,FALSE),0)","v":69409516.459999979},null,null,0.17726510863908634,72746979.399999961]
["NT","Northern Territory",null,null,0,{"$f":"IFERROR(VLOOKUP(A59,'[8]Geographic '!$A$1:$C$9,3,FALSE),0)","v":0},null,null,0,0]
["ACT","Australian Capital Territory",null,null,1.5384269621740196E-4,{"$f":"IFERROR(VLOOKUP(A60,'[8]Geographic '!$A$1:$C$9,3,FALSE),0)","v":58960.45},null,null,1.5794933130300096E-4,64820.069999999992]
["TAS","Tasmania",null,null,8.4380108774828634E-3,{"$f":"IFERROR(VLOOKUP(A61,'[8]Geographic '!$A$1:$C$9,3,FALSE),0)","v":3233880.6500000004},null,null,8.4309414150312498E-3,3459933.69]
["WA","Western Australia",null,null,0.19320521539264851,{"$f":"IFERROR(VLOOKUP(A62,'[8]Geographic '!$A$1:$C$9,3,FALSE),0)","v":74046196.029999986},null,null,0.19581802376684221,80360821.430000022]
[null,"Total",null,null,{"$f":"SUM(E55:E62)","v":1.0000000000000002},{"$f":"SUM(F55:F62)","v":383251538.4199999},null,null,1,410385213.19]
["AG",null,null,null,null,null,{"$f":"E13-F63","v":0},null,null,null,0]
["CE","Top Industry Distribution"]
["AGRICULTURAL MACHINERY","Agricultural",null,null,{"$f":"F66/F$69","v":0.92874675511393878},{"$f":"IFERROR(VLOOKUP(A66,'[8]Top Industry'!$A$1:$C$4,3,FALSE),)","v":355943622.69999987},null,null,0.92796491411031079,380823079.10999954]
["CONSTRUCTION EQUIPMENT","Construction",null,null,{"$f":"F67/F$69","v":7.1253244886061357E-2},{"$f":"IFERROR(VLOOKUP(A67,'[8]Top Industry'!$A$1:$C$4,3,FALSE),)","v":27307915.719999999},null,null,7.2035085889689154E-2,29562134.080000013]
["MOTOR VEHICLE - AG","Motor Vehicle AG",null,null,{"$f":"F68/F$69","v":0},{"$f":"IFERROR(VLOOKUP(A68,'[8]Top Industry'!$A$1:$C$4,3,FALSE),)","v":0},null,null,0,0]
[null,"Total",null,null,{"$f":"SUM(E66:E68)","v":1.0000000000000002},{"$f":"SUM(F66:F68)","v":383251538.41999984},{"$f":"F63-F69","v":0},null,1,410385213.18999958,0]
["COMBINE"]
["40-100 HP TRACTOR","Collateral Types"]
["100<140 HP TRACTOR","100<140 HP TRACTOR",null,null,{"$f":"IFERROR(F72/F$104,0)","v":0.1007218431245978},{"$f":"IFERROR(VLOOKUP(A72,[8]Collateral!$A$1:$C$34,3,FALSE),\"\")","v":38601801.330000013},null,null,0.10051494735728245,41249848.099999994]
["4 EWD TRACTORS","4 EWD TRACTORS",null,null,9.8382964059179165E-2,{"$f":"IFERROR(VLOOKUP(A73,[8]Collateral!$A$1:$C$34,3,FALSE),\"\")","v":37705422.329999991},null,null,0.10508305251737765,43124530.910000004]
["40<60 HP TRACTOR","40<60 HP TRACTOR",null,null,1.2975684091188728E-2,{"$f":"IFERROR(VLOOKUP(A74,[8]Collateral!$A$1:$C$34,3,FALSE),\"\")","v":4972950.8900000006},null,null,1.318187026757088E-2,5409644.6399999997]
["4WD Vehicle","4WD Vehicle",null,null,3.9917368011279063E-3,{"$f":"IFERROR(VLOOKUP(A75,[8]Collateral!$A$1:$C$34,3,FALSE),\"\")","v":1529839.27},null,null,3.7864806529483031E-3,1553915.6700000002]
["60<100 HP TRACTOR","60<100 HP TRACTOR",null,null,4.6421141121430046E-2,{"$f":"IFERROR(VLOOKUP(A76,[8]Collateral!$A$1:$C$34,3,FALSE),\"\")","v":17790973.749999993},null,null,4.6930562093822771E-2,19259608.729999997]
["BACKHOE","BACKHOE",null,null,7.4072842908954988E-4,{"$f":"IFERROR(VLOOKUP(A77,[8]Collateral!$A$1:$C$34,3,FALSE),\"\")","v":283885.30999999994},null,null,7.2330018348534613E-4,296831.69999999995]
["BALERS, WINDROWERS, MOWERS, RAKES","BALERS, WINDROWERS, MOWERS, RAKES",null,null,2.4731878491802983E-2,{"$f":"IFERROR(VLOOKUP(A78,[8]Collateral!$A$1:$C$34,3,FALSE),\"\")","v":9478530.4800000042},null,null,2.5012008206172172E-2,10264558.319999998]
["COMBINES","COMBINES",null,null,0.33365369818780866,{"$f":"IFERROR(VLOOKUP(A79,[8]Collateral!$A$1:$C$34,3,FALSE),\"\")","v":127873293.13000005},null,null,0.32706074703977811,134220894.40000004]
["COMPACT TRACK LOADER","COMPACT TRACK LOADER",null,null,1.3198669053890551E-2,{"$f":"IFERROR(VLOOKUP(A80,[8]Collateral!$A$1:$C$34,3,FALSE),\"\")","v":5058410.2200000007},null,null,1.3428185014669721E-2,5510728.5699999984]
["COMPACT WHEEL LOADER","COMPACT WHEEL LOADER",null,null,7.3054456912100159E-4,{"$f":"IFERROR(VLOOKUP(A81,[8]Collateral!$A$1:$C$34,3,FALSE),\"\")","v":279982.32999999996},null,null,7.2181487168460697E-4,296222.15000000002]
["CRAWLER EXCAVATOR","CRAWLER EXCAVATOR",null,null,1.3548093509046269E-2,{"$f":"IFERROR(VLOOKUP(A82,[8]Collateral!$A$1:$C$34,3,FALSE),\"\")","v":5192327.68},null,null,1.3638023520620305E-2,5596843.1899999995]
["CULTIVATORS,SEEDERS, HARROWS","CULTIVATORS,SEEDERS, HARROWS",null,null,1.3427300647546348E-2,{"$f":"IFERROR(VLOOKUP(A83,[8]Collateral!$A$1:$C$34,3,FALSE),\"\")","v":5146033.6300000008},null,null,1.2948548751779157E-2,5313892.9399999995]
["DRILL","DRILL",null,null,9.270036109043831E-4,{"$f":"IFERROR(VLOOKUP(A84,[8]Collateral!$A$1:$C$34,3,FALSE),\"\")","v":355275.56},null,null,8.6571238090762915E-4,355275.56]
["EXCAVATORS / GRADERS","EXCAVATORS / GRADERS",null,null,3.0035422812537088E-4,{"$f":"IFERROR(VLOOKUP(A85,[8]Collateral!$A$1:$C$34,3,FALSE),\"\")","v":115111.22000000004},null,null,3.1812656938873664E-4,130554.44000000005]
["FEEDERS, MIXERS, WAGONS, BINS, FEED STORAGE","FEEDERS, MIXERS, WAGONS, BINS, FEED STORAGE",null,null,2.5778117005686193E-4,{"$f":"IFERROR(VLOOKUP(A86,[8]Collateral!$A$1:$C$34,3,FALSE),\"\")","v":98795.03},null,null,2.4952117354333362E-4,102399.79999999999]
["FRONT END LOADER","FRONT END LOADER",null,null,1.1902396318631322E-3,{"$f":"IFERROR(VLOOKUP(A87,[8]Collateral!$A$1:$C$34,3,FALSE),\"\")","v":456161.17},null,null,1.1590133482216555E-3,475641.93999999994]
["FRONTS","FRONTS",null,null,4.3155367798875582E-3,{"$f":"IFERROR(VLOOKUP(A88,[8]Collateral!$A$1:$C$34,3,FALSE),\"\")","v":1653936.1099999999},null,null,4.6322082007371939E-3,1900989.7500000002]
["GRADER","GRADER",null,null,7.1412196054923256E-4,{"$f":"IFERROR(VLOOKUP(A89,[8]Collateral!$A$1:$C$34,3,FALSE),\"\")","v":273688.33999999997},null,null,6.9452273337158605E-4,285021.85999999993]
["HARVESTERS - Other","HARVESTERS - Other",null,null,1.0143172904213803E-2,{"$f":"IFERROR(VLOOKUP(A90,[8]Collateral!$A$1:$C$34,3,FALSE),\"\")","v":3887386.62},null,null,1.0046950273744581E-2,4123119.83]
["IRRIGATION EQUIPMENT","IRRIGATION EQUIPMENT",null,null,1.2544691718187515E-3,{"$f":"IFERROR(VLOOKUP(A91,[8]Collateral!$A$1:$C$34,3,FALSE),\"\")","v":480777.23999999993},null,null,1.230692855802697E-3,505058.14999999985]
["MIDI CRAWLER EXCAVATOR","MIDI CRAWLER EXCAVATOR",null,null,8.2862558441181575E-4,{"$f":"IFERROR(VLOOKUP(A92,[8]Collateral!$A$1:$C$34,3,FALSE),\"\")","v":317572.03000000003},null,null,8.4510561992259174E-4,346818.85000000003]
["MINI EXCAVATOR","MINI EXCAVATOR",null,null,1.7063660036331689E-2,{"$f":"IFERROR(VLOOKUP(A93,[8]Collateral!$A$1:$C$34,3,FALSE),\"\")","v":6539673.9599999944},null,null,1.7348859415906182E-2,7119715.3700000001]
["OTHER AG","OTHER AG",null,null,9.0732938590039405E-3,{"$f":"IFERROR(VLOOKUP(A94,[8]Collateral!$A$1:$C$34,3,FALSE),\"\")","v":3477353.8299999996},null,null,8.8496612530689859E-3,3631770.1199999992]
["OTHER CE","OTHER CE",null,null,1.4623534254044188E-4,{"$f":"IFERROR(VLOOKUP(A95,[8]Collateral!$A$1:$C$34,3,FALSE),\"\")","v":56044.920000000027},null,null,1.5155923751863776E-4,62197.670000000027]
["OVER 140 HP TRACTOR","OVER 140 HP TRACTOR",null,null,0.19582862291801678,{"$f":"IFERROR(VLOOKUP(A96,[8]Collateral!$A$1:$C$34,3,FALSE),\"\")","v":75051621.000000015},null,null,0.19333381135559227,79341337.390000001]
["SCRAPERS","SCRAPERS",null,null,7.1696862883528225E-4,{"$f":"IFERROR(VLOOKUP(A97,[8]Collateral!$A$1:$C$34,3,FALSE),\"\")","v":274779.32999999996},null,null,7.3633150096004277E-4,302179.55999999994]
["SKID STEER LOADER","SKID STEER LOADER",null,null,1.6469757997638352E-2,{"$f":"IFERROR(VLOOKUP(A98,[8]Collateral!$A$1:$C$34,3,FALSE),\"\")","v":6312060.0899999989},null,null,1.6641691636287276E-2,6829504.1699999953]
["SKIDSTEER / UNILOADER","SKIDSTEER / UNILOADER",null,null,2.203169760207638E-4,{"$f":"IFERROR(VLOOKUP(A99,[8]Collateral!$A$1:$C$34,3,FALSE),\"\")","v":84436.819999999992},null,null,2.3410519412530575E-4,96073.309999999969]
["SPRAYING EQUIPMENT","SPRAYING EQUIPMENT",null,null,7.0390038122785506E-2,{"$f":"IFERROR(VLOOKUP(A100,[8]Collateral!$A$1:$C$34,3,FALSE),\"\")","v":26977090.399999999},null,null,7.1966060766245121E-2,29533807.190000009]
["TRENCHERS","TRENCHERS",null,null,3.3897364257317355E-4,{"$f":"IFERROR(VLOOKUP(A101,[8]Collateral!$A$1:$C$34,3,FALSE),\"\")","v":129912.17},null,null,3.5485779048422244E-4,145628.39000000001]
["UNDER 40 HP TRACTORS","UNDER 40 HP TRACTORS",null,null,1.0603504207063422E-3,{"$f":"IFERROR(VLOOKUP(A102,[8]Collateral!$A$1:$C$34,3,FALSE),\"\")","v":406380.92999999993},null,null,1.1130656157158311E-3,456785.67000000004]
["WHEEL LOADERS","WHEEL LOADERS",null,null,6.2361949278877974E-3,{"$f":"IFERROR(VLOOKUP(A103,[8]Collateral!$A$1:$C$34,3,FALSE),\"\")","v":2390031.2999999998},null,null,6.1986026012644489E-3,2543814.85]
[null,"Total",null,null,{"$f":"SUM(E72:E103)","v":0.99999999999999989},{"$f":"SUM(F72:F103)","v":383251538.42000008},{"$f":"F69-F104","v":0},null,0.99999999999999978,410385213.19000012,-5.3644180297851563E-7]
["$ 0 - $25,000"]
["$ 25,001 to $50,000","Contract Balance Distribution"]
["$0 - $25,000","$ 0 - $25,000",null,null,{"$f":"IFERROR(F107/F$118,0)","v":2.555686834390767E-2},{"$f":"IFERROR(VLOOKUP(A107,'[8] Balance Distribution'!$A$1:$C$13,3,FALSE),\"\")","v":9794709.1100000124},null,null,2.0816799035214772E-2,8542906.5099999998]
["$25,001 - $50,000","$ 25,001 to $50,000",null,null,{"$f":"IFERROR(F108/F$118,0)","v":8.1715914929164135E-2},{"$f":"IFERROR(VLOOKUP(A108,'[8] Balance Distribution'!$A$1:$C$13,3,FALSE),\"\")","v":31317750.109999999},null,null,7.8179603306383891E-2,32083753.169999979]
["$50,001 - $75,000","$ 50,001 to $75,000",null,null,7.659304401233985E-2,{"$f":"IFERROR(VLOOKUP(A109,'[8] Balance Distribution'!$A$1:$C$13,3,FALSE),\"\")","v":29354401.950000018},null,null,7.4406360898444046E-2,30535270.280000035]
["$75,001 - $100,000","$ 75,001 to $100,000",null,null,5.8935603371921885E-2,{"$f":"IFERROR(VLOOKUP(A110,'[8] Balance Distribution'!$A$1:$C$13,3,FALSE),\"\")","v":22587160.660000004},null,null,5.940096749712527E-2,24377278.710000012]
["$100,001 - $125,000","$100,001 to $125,000",null,null,5.1387226601077245E-2,{"$f":"IFERROR(VLOOKUP(A111,'[8] Balance Distribution'!$A$1:$C$13,3,FALSE),\"\")","v":19694233.650000002},null,null,5.1689211960419867E-2,21212488.270000003]
["$125,001 - $150,000","$125,001 to $150,000",null,null,4.5620575359150553E-2,{"$f":"IFERROR(VLOOKUP(A112,'[8] Balance Distribution'!$A$1:$C$13,3,FALSE),\"\")","v":17484155.689999994},null,null,4.2201208774990076E-2,17318752.059999999]
["$150,001 - $200,000","$150,000 to $200,000",null,null,0.10161435578458648,{"$f":"IFERROR(VLOOKUP(A113,'[8] Balance Distribution'!$A$1:$C$13,3,FALSE),\"\")","v":38943858.18},null,null,9.5551640116831357E-2,39212980.199999988]
["$200,001 - $300,000","$200,001 to $300,000",null,null,0.22285078244461629,{"$f":"IFERROR(VLOOKUP(A114,'[8] Balance Distribution'!$A$1:$C$13,3,FALSE),\"\")","v":85407905.209999919},null,null,0.21822218533136511,89555158.049999952]
["$300,001 - $400,000","$300,001 to $400,000",null,null,0.1677875304430721,{"$f":"IFERROR(VLOOKUP(A115,'[8] Balance Distribution'!$A$1:$C$13,3,FALSE),\"\")","v":64304829.169999972},null,null,0.16993880933938918,69740374.499999985]
["$400,001 - $500,000","$400,001 to $500,000",null,null,9.1736482298136746E-2,{"$f":"IFERROR(VLOOKUP(A116,'[8] Balance Distribution'!$A$1:$C$13,3,FALSE),\"\")","v":35158147.970000006},null,null,0.1000432276320633,41056261.29999999]
["$500,001+","$500,000+",null,null,7.6201616412026829E-2,{"$f":"IFERROR(VLOOKUP(A117,'[8] Balance Distribution'!$A$1:$C$13,3,FALSE),\"\")","v":29204386.720000003},null,null,8.9549986107773122E-2,36749990.140000008]
["$200,001 to $300,000","Total",null,null,{"$f":"SUM(E107:E117)","v":0.99999999999999989},{"$f":"SUM(F107:F117)","v":383251538.42000002},{"$f":"F104-F118","v":0},null,1,410385213.18999994,0]
["0"]
["0 to 5","Residual / Balloon Payment Distribution"]
{"$rows_left_out":118}